Target
Beta-secretase 1
Ligand
BDBM50386481
Substrate
Meas. Tech.
ChEMBL_826120 (CHEMBL2049561)
IC50
2±n/a nM
Citation
 Rueeger, HLueoend, RRogel, ORondeau, JMMöbitz, HMachauer, RJacobson, LStaufenbiel, MDesrayaud, SNeumann, U Discovery of cyclic sulfone hydroxyethylamines as potent and selectiveß-site APP-cleaving enzyme 1 (BACE1) inhibitors: structure-based design and in vivo reduction of amyloidß-peptides. J Med Chem 55:3364-86 (2012)  
Target
Name:
Beta-secretase 1
Synonyms:
ASP2 Aspartyl protease 2 BACE1 Beta-secretase (BACE) Beta-secretase 1 (BACE 1) Beta-secretase 1 (BACE1) Beta-site amyloid precursor protein cleaving enzyme 1 Memapsin-2 beta-Secretase (BACE-1) | beta-Secretase (BACE1)
Type:
Protein
Mol. Mass.:
55755.10
Organism:
Homo sapiens (Human)
Description:
P56817
Residue:
501
  
Inhibitor
Name:
BDBM50386481
Synonyms:
CHEMBL2048058
Type:
Small organic molecule
Emp. Form.:
C25H29F7N2O5S
Mol. Mass.:
602.562
SMILES:
CC(C)(O)c1cccc(CN[C@H]2CS(=O)(=O)C[C@@H](Cc3cc(F)c(N)c(OC(C(F)(F)F)C(F)(F)F)c3)[C@@H]2O)c1
: