Target
Free fatty acid receptor 1
Ligand
BDBM50386652
Substrate
Meas. Tech.
ChEMBL_826836 (CHEMBL2051553)
Ki
30±n/a nM
Citation
 Mikami, SKitamura, SNegoro, NSasaki, SSuzuki, MTsujihata, YMiyazaki, TIto, RSuzuki, NMiyazaki, JSantou, TKanzaki, NFunami, MTanaka, TYasuma, TMomose, Y Discovery of phenylpropanoic acid derivatives containing polar functionalities as potent and orally bioavailable G protein-coupled receptor 40 agonists for the treatment of type 2 diabetes. J Med Chem 55:3756-76 (2012)  
Target
Name:
Free fatty acid receptor 1
Synonyms:
FFAR1_RAT G-protein coupled receptor 40 | Gpr40
Type:
PROTEIN
Mol. Mass.:
31848.38
Organism:
Rattus norvegicus
Description:
ChEMBL_1511162
Residue:
300
  
Inhibitor
Name:
BDBM50386652
Synonyms:
CHEMBL2048610
Type:
Small organic molecule
Emp. Form.:
C25H26O3
Mol. Mass.:
374.4721
SMILES:
Cc1cccc(C)c1-c1cccc(COc2ccc(CCC(O)=O)cc2)c1C
: