Target
Free fatty acid receptor 1
Ligand
BDBM50386644
Substrate
Meas. Tech.
ChEMBL_826836 (CHEMBL2051553)
Ki
4.5±n/a nM
Citation
 Mikami, SKitamura, SNegoro, NSasaki, SSuzuki, MTsujihata, YMiyazaki, TIto, RSuzuki, NMiyazaki, JSantou, TKanzaki, NFunami, MTanaka, TYasuma, TMomose, Y Discovery of phenylpropanoic acid derivatives containing polar functionalities as potent and orally bioavailable G protein-coupled receptor 40 agonists for the treatment of type 2 diabetes. J Med Chem 55:3756-76 (2012)  
Target
Name:
Free fatty acid receptor 1
Synonyms:
FFAR1_RAT G-protein coupled receptor 40 | Gpr40
Type:
PROTEIN
Mol. Mass.:
31848.38
Organism:
Rattus norvegicus
Description:
ChEMBL_1511162
Residue:
300
  
Inhibitor
Name:
BDBM50386644
Synonyms:
CHEMBL2048618
Type:
Small organic molecule
Emp. Form.:
C28H31FO5
Mol. Mass.:
466.5411
SMILES:
CCOCCOc1cc(C)c(c(C)c1)-c1cccc(COc2ccc(CCC(O)=O)c(F)c2)c1
: