Target
Free fatty acid receptor 1
Ligand
BDBM50386655
Substrate
Meas. Tech.
ChEMBL_826835 (CHEMBL2051552)
Ki
47±n/a nM
Citation
 Mikami, SKitamura, SNegoro, NSasaki, SSuzuki, MTsujihata, YMiyazaki, TIto, RSuzuki, NMiyazaki, JSantou, TKanzaki, NFunami, MTanaka, TYasuma, TMomose, Y Discovery of phenylpropanoic acid derivatives containing polar functionalities as potent and orally bioavailable G protein-coupled receptor 40 agonists for the treatment of type 2 diabetes. J Med Chem 55:3756-76 (2012)  
Target
Name:
Free fatty acid receptor 1
Synonyms:
FFAR1 G-protein Coupled Receptor 40 | GPR40
Type:
G Protein-Coupled Receptor (GPCR)
Mol. Mass.:
31473.32
Organism:
Homo sapiens (Human)
Description:
O14842
Residue:
300
  
Inhibitor
Name:
BDBM50386655
Synonyms:
CHEMBL2048613
Type:
Small organic molecule
Emp. Form.:
C25H26O4
Mol. Mass.:
390.4715
SMILES:
COc1ccc(COc2ccc(CCC(O)=O)cc2)cc1-c1c(C)cccc1C
: