Target
Receptor tyrosine-protein kinase erbB-2
Ligand
BDBM50386694
Substrate
Meas. Tech.
ChEMBL_827249 (CHEMBL2050648)
IC50
1.3±n/a nM
Citation
 Kawakita, YBanno, HOhashi, TTamura, TYusa, TNakayama, AMiki, HIwata, HKamiguchi, HTanaka, THabuka, NSogabe, SOhta, YIshikawa, T Design and synthesis of pyrrolo[3,2-d]pyrimidine human epidermal growth factor receptor 2 (HER2)/epidermal growth factor receptor (EGFR) dual inhibitors: exploration of novel back-pocket binders. J Med Chem 55:3975-91 (2012)  
Target
Name:
Receptor tyrosine-protein kinase erbB-2
Synonyms:
2.7.10.1 CD_antigen=CD340 ERBB2_HUMAN FASN/HER2 HER2 MLN19 NEU Proto-oncogene Neu Tyrosine kinase-type cell surface receptor HER2 | p185erbB2
Type:
Mol. Mass.:
137894.47
Organism:
Homo sapiens (Human)
Description:
P04626
Residue:
1255
  
Inhibitor
Name:
BDBM50386694
Synonyms:
CHEMBL2048789
Type:
Small organic molecule
Emp. Form.:
C22H18ClN5O3
Mol. Mass.:
435.863
SMILES:
OCCn1ccc2ncnc(Nc3ccc(Oc4ccc5CNC(=O)c5c4)c(Cl)c3)c12
: