Target
Receptor tyrosine-protein kinase erbB-2
Ligand
BDBM50386713
Substrate
Meas. Tech.
ChEMBL_827249 (CHEMBL2050648)
IC50
2.3±n/a nM
Citation
 Kawakita, YBanno, HOhashi, TTamura, TYusa, TNakayama, AMiki, HIwata, HKamiguchi, HTanaka, THabuka, NSogabe, SOhta, YIshikawa, T Design and synthesis of pyrrolo[3,2-d]pyrimidine human epidermal growth factor receptor 2 (HER2)/epidermal growth factor receptor (EGFR) dual inhibitors: exploration of novel back-pocket binders. J Med Chem 55:3975-91 (2012)  
Target
Name:
Receptor tyrosine-protein kinase erbB-2
Synonyms:
2.7.10.1 CD_antigen=CD340 ERBB2_HUMAN FASN/HER2 HER2 MLN19 NEU Proto-oncogene Neu Tyrosine kinase-type cell surface receptor HER2 | p185erbB2
Type:
Mol. Mass.:
137894.47
Organism:
Homo sapiens (Human)
Description:
P04626
Residue:
1255
  
Inhibitor
Name:
BDBM50386713
Synonyms:
CHEMBL2048788
Type:
Small organic molecule
Emp. Form.:
C25H26ClN5O3
Mol. Mass.:
479.959
SMILES:
CC(C)(C)NC(=O)c1cccc(Oc2ccc(Nc3ncnc4ccn(CCO)c34)cc2Cl)c1
: