Target
Carbonic anhydrase 14
Ligand
BDBM50386730
Substrate
Meas. Tech.
ChEMBL_826610 (CHEMBL2050864)
Ki
5.2±n/a nM
Citation
 Gitto, RDamiano, FMMader, PDe Luca, LFerro, SSupuran, CTVullo, DBrynda, JRezácová, PChimirri, A Synthesis, structure-activity relationship studies, and X-ray crystallographic analysis of arylsulfonamides as potent carbonic anhydrase inhibitors. J Med Chem 55:3891-9 (2012)  
Target
Name:
Carbonic anhydrase 14
Synonyms:
CA-XIV CAH14_HUMAN Carbonic Anhydrase XIV Carbonic anhydrase 14 Carbonic anhydrase XIV (CA XIV)
Type:
Enzyme
Mol. Mass.:
37665.67
Organism:
Homo sapiens (Human)
Description:
Human (cloned) isozyme.
Residue:
337
  
Inhibitor
Name:
BDBM50386730
Synonyms:
CHEMBL2048933
Type:
Small organic molecule
Emp. Form.:
C16H19N3O5S2
Mol. Mass.:
397.469
SMILES:
COc1ccc2C(N(CCc2c1)S(N)(=O)=O)c1ccc(cc1)S(N)(=O)=O
: