Target
Eukaryotic translation initiation factor 4E
Ligand
BDBM50386768
Substrate
Meas. Tech.
ChEMBL_826735 (CHEMBL2051182)
IC50
125±n/a nM
Citation
 Chen, XKopecky, DJMihalic, JJeffries, SMin, XHeath, JDeignan, JLai, SFu, ZGuimaraes, CShen, SLi, SJohnstone, SThibault, SXu, HCardozo, MShen, WWalker, NKayser, FWang, Z Structure-guided design, synthesis, and evaluation of guanine-derived inhibitors of the eIF4E mRNA-cap interaction. J Med Chem 55:3837-51 (2012)  
Target
Name:
Eukaryotic translation initiation factor 4E
Synonyms:
EIF4E EIF4F Eukaryotic translation initiation factor 4E (eIF4E) IF4E_HUMAN
Type:
Protein
Mol. Mass.:
25095.44
Organism:
Homo sapiens (Human)
Description:
P06730
Residue:
217
  
Inhibitor
Name:
BDBM50386768
Synonyms:
CHEMBL2046908
Type:
Small organic molecule
Emp. Form.:
C19H21N6O9P
Mol. Mass.:
508.3786
SMILES:
Nc1nc2n(c[n+](CCOc3ccc(cc3)C#N)c2c(=O)[nH]1)[C@@H]1O[C@H](COP(O)([O-])=O)[C@@H](O)[C@H]1O
: