Target
Eukaryotic translation initiation factor 4E
Ligand
BDBM50386769
Substrate
Meas. Tech.
ChEMBL_826737 (CHEMBL2051184)
IC50
2650±n/a nM
Citation
 Chen, XKopecky, DJMihalic, JJeffries, SMin, XHeath, JDeignan, JLai, SFu, ZGuimaraes, CShen, SLi, SJohnstone, SThibault, SXu, HCardozo, MShen, WWalker, NKayser, FWang, Z Structure-guided design, synthesis, and evaluation of guanine-derived inhibitors of the eIF4E mRNA-cap interaction. J Med Chem 55:3837-51 (2012)  
Target
Name:
Eukaryotic translation initiation factor 4E
Synonyms:
EIF4E | IF4E_RABIT
Type:
PROTEIN
Mol. Mass.:
25047.40
Organism:
Oryctolagus cuniculus
Description:
ChEMBL_1511842
Residue:
217
  
Inhibitor
Name:
BDBM50386769
Synonyms:
CHEMBL2046910
Type:
Small organic molecule
Emp. Form.:
C18H20ClFN5O9P
Mol. Mass.:
535.805
SMILES:
Nc1nc2n(c[n+](CCOc3ccc(Cl)c(F)c3)c2c(=O)[nH]1)[C@@H]1O[C@H](COP(O)([O-])=O)[C@@H](O)[C@H]1O
: