Target
Eukaryotic translation initiation factor 4E
Ligand
BDBM50316302
Substrate
Meas. Tech.
ChEMBL_826735 (CHEMBL2051182)
Ki
28±n/a nM
Citation
 Chen, XKopecky, DJMihalic, JJeffries, SMin, XHeath, JDeignan, JLai, SFu, ZGuimaraes, CShen, SLi, SJohnstone, SThibault, SXu, HCardozo, MShen, WWalker, NKayser, FWang, Z Structure-guided design, synthesis, and evaluation of guanine-derived inhibitors of the eIF4E mRNA-cap interaction. J Med Chem 55:3837-51 (2012)  
Target
Name:
Eukaryotic translation initiation factor 4E
Synonyms:
EIF4E EIF4F Eukaryotic translation initiation factor 4E (eIF4E) IF4E_HUMAN
Type:
Protein
Mol. Mass.:
25095.44
Organism:
Homo sapiens (Human)
Description:
P06730
Residue:
217
  
Inhibitor
Name:
BDBM50316302
Synonyms:
((2R,3S,4R,5R)-5-(2-amino-7-methyl-6-oxo-1H-purin-1-ium-9(6H)-yl)-3,4-dihydroxytetrahydrofuran-2-yl)methyl hydrogen triphosphate | CHEMBL1094973
Type:
Small organic molecule
Emp. Form.:
C11H18N5O14P3
Mol. Mass.:
537.207
SMILES:
C[n+]1cn([C@@H]2O[C@H](COP([O-])(=O)OP(O)(=O)OP(O)(O)=O)[C@@H](O)[C@H]2O)c2nc(N)[nH]c(=O)c12
: