Target
Free fatty acid receptor 1
Ligand
BDBM50386781
Substrate
Meas. Tech.
ChEMBL_827107 (CHEMBL2050357)
Ki
23±n/a nM
Citation
 Negoro, NSasaki, SMikami, SIto, MTsujihata, YIto, RSuzuki, MTakeuchi, KSuzuki, NMiyazaki, JSantou, TOdani, TKanzaki, NFunami, MMorohashi, ANonaka, MMatsunaga, SYasuma, TMomose, Y Optimization of (2,3-dihydro-1-benzofuran-3-yl)acetic acids: discovery of a non-free fatty acid-like, highly bioavailable G protein-coupled receptor 40/free fatty acid receptor 1 agonist as a glucose-dependent insulinotropic agent. J Med Chem 55:3960-74 (2012)  
Target
Name:
Free fatty acid receptor 1
Synonyms:
FFAR1 G-protein Coupled Receptor 40 | GPR40
Type:
G Protein-Coupled Receptor (GPCR)
Mol. Mass.:
31473.32
Organism:
Homo sapiens (Human)
Description:
O14842
Residue:
300
  
Inhibitor
Name:
BDBM50386781
Synonyms:
CHEMBL2047149
Type:
Small organic molecule
Emp. Form.:
C29H32O6
Mol. Mass.:
476.5608
SMILES:
CCOCCOc1cc(C)c(c(C)c1)-c1cccc(COc2ccc3[C@H](CC(O)=O)COc3c2)c1
: