Target
Free fatty acid receptor 1
Ligand
BDBM50386796
Substrate
Meas. Tech.
ChEMBL_827108 (CHEMBL2050358)
Ki
400±n/a nM
Citation
 Negoro, NSasaki, SMikami, SIto, MTsujihata, YIto, RSuzuki, MTakeuchi, KSuzuki, NMiyazaki, JSantou, TOdani, TKanzaki, NFunami, MMorohashi, ANonaka, MMatsunaga, SYasuma, TMomose, Y Optimization of (2,3-dihydro-1-benzofuran-3-yl)acetic acids: discovery of a non-free fatty acid-like, highly bioavailable G protein-coupled receptor 40/free fatty acid receptor 1 agonist as a glucose-dependent insulinotropic agent. J Med Chem 55:3960-74 (2012)  
Target
Name:
Free fatty acid receptor 1
Synonyms:
FFAR1_RAT G-protein coupled receptor 40 | Gpr40
Type:
PROTEIN
Mol. Mass.:
31848.38
Organism:
Rattus norvegicus
Description:
ChEMBL_1511162
Residue:
300
  
Inhibitor
Name:
BDBM50386796
Synonyms:
CHEMBL2047165
Type:
Small organic molecule
Emp. Form.:
C32H36O7S
Mol. Mass.:
564.689
SMILES:
Cc1c(C)c(c(C)c(C)c1OC1CCS(=O)(=O)CC1)-c1cccc(COc2ccc3[C@H](CC(O)=O)COc3c2)c1
: