Target
Sphingosine 1-phosphate receptor 1
Ligand
BDBM50386857
Substrate
Meas. Tech.
ChEMBL_828467 (CHEMBL2049904)
EC50
4.6±n/a nM
Citation
 Buzard, DJHan, SLopez, LKawasaki, AMoody, JThoresen, LUllman, BLehmann, JCalderon, IZhu, XGharbaoui, TSengupta, DKrishnan, AGao, YEdwards, JBarden, JMorgan, MUsmani, KChen, CSadeque, AThatte, JSolomon, MFu, LWhelan, KLiu, LAl-Shamma, HGatlin, JLe, MXing, CEspinola, SJones, RM Fused tricyclic indoles as S1P1 agonists with robust efficacy in animal models of autoimmune disease. Bioorg Med Chem Lett 22:4404-9 (2012)  
Target
Name:
Sphingosine 1-phosphate receptor 1
Synonyms:
CHEDG1 Endothelial differentiation G-protein coupled receptor 1 S1P1 S1PR1_HUMAN Sphingosine 1-phosphate receptor Edg-1
Type:
Enzyme
Mol. Mass.:
42836.02
Organism:
Homo sapiens (Human)
Description:
P21453
Residue:
382
  
Inhibitor
Name:
BDBM50386857
Synonyms:
CHEMBL2048291
Type:
Small organic molecule
Emp. Form.:
C23H18N4O4
Mol. Mass.:
414.4134
SMILES:
COc1ccc(cc1C#N)-c1nc(no1)-c1ccc2[nH]c3C(CC(O)=O)CCc3c2c1
: