Target
Sphingosine 1-phosphate receptor 4
Ligand
BDBM50386859
Substrate
Meas. Tech.
ChEMBL_828474 (CHEMBL2049911)
EC50
>100000±n/a nM
Citation
 Buzard, DJHan, SLopez, LKawasaki, AMoody, JThoresen, LUllman, BLehmann, JCalderon, IZhu, XGharbaoui, TSengupta, DKrishnan, AGao, YEdwards, JBarden, JMorgan, MUsmani, KChen, CSadeque, AThatte, JSolomon, MFu, LWhelan, KLiu, LAl-Shamma, HGatlin, JLe, MXing, CEspinola, SJones, RM Fused tricyclic indoles as S1P1 agonists with robust efficacy in animal models of autoimmune disease. Bioorg Med Chem Lett 22:4404-9 (2012)  
Target
Name:
Sphingosine 1-phosphate receptor 4
Synonyms:
EDG6 S1P receptor 4 S1P4 S1PR4_HUMAN Sphingosine 1-phosphate receptor Edg-6 sphingosine-1-phosphate 4 S1P4
Type:
G Protein-Coupled Receptor (GPCR)
Mol. Mass.:
41647.39
Organism:
Homo sapiens (Human)
Description:
Residue:
384
  
Inhibitor
Name:
BDBM50386859
Synonyms:
CHEMBL2048293
Type:
Small organic molecule
Emp. Form.:
C23H15F3N4O4
Mol. Mass.:
468.3848
SMILES:
OC(=O)CC1CCn2c1cc1cc(ccc21)-c1noc(n1)-c1cc(OC(F)(F)F)cc(c1)C#N
: