Target
Cytochrome P450 3A4
Ligand
BDBM50386883
Substrate
Meas. Tech.
ChEMBL_827410 (CHEMBL2051080)
IC50
40300±n/a nM
Citation
 Ohtake, YSato, TMatsuoka, HKobayashi, TNishimoto, MTaka, NTakano, KYamamoto, KOhmori, MHiguchi, TMurakata, MMorikawa, KShimma, NSuzuki, MHagita, HOzawa, KYamaguchi, KKato, MIkeda, S C-Aryl 5a-carba-ß-d-glucopyranosides as novel sodium glucose cotransporter 2 (SGLT2) inhibitors for the treatment of type 2 diabetes. Bioorg Med Chem 20:4117-27 (2012)  
Target
Name:
Cytochrome P450 3A4
Synonyms:
Albendazole monooxygenase CP3A4_HUMAN CYP3A4 CYPIIIA4 Cytochrome P450 3A4 (CYP3A4) Nifedipine oxidase Taurochenodeoxycholate 6-alpha-hydroxylase
Type:
Enzyme
Mol. Mass.:
57349.57
Organism:
Homo sapiens (Human)
Description:
Residue:
503
  
Inhibitor
Name:
BDBM50386883
Synonyms:
CHEMBL2048496
Type:
Small organic molecule
Emp. Form.:
C24H32O6
Mol. Mass.:
416.5073
SMILES:
CCc1ccc(Cc2cc([C@@H]3C[C@H](CO)[C@@H](O)[C@H](O)[C@H]3O)c(OC)cc2OC)cc1
: