Target
Sodium/glucose cotransporter 1
Ligand
BDBM50386890
Substrate
Meas. Tech.
ChEMBL_827407 (CHEMBL2051077)
IC50
25000±n/a nM
Citation
 Ohtake, YSato, TMatsuoka, HKobayashi, TNishimoto, MTaka, NTakano, KYamamoto, KOhmori, MHiguchi, TMurakata, MMorikawa, KShimma, NSuzuki, MHagita, HOzawa, KYamaguchi, KKato, MIkeda, S C-Aryl 5a-carba-ß-d-glucopyranosides as novel sodium glucose cotransporter 2 (SGLT2) inhibitors for the treatment of type 2 diabetes. Bioorg Med Chem 20:4117-27 (2012)  
Target
Name:
Sodium/glucose cotransporter 1
Synonyms:
High affinity sodium-glucose cotransporter Na(+)/glucose cotransporter 1 SGLT1 Sodium-dependent glucose cotransporter 1 (SGLT1) Sodium/glucose cotransporter 1 (SGLT1) | Solute carrier family 5 member 1
Type:
Protein
Mol. Mass.:
73503.78
Organism:
Homo sapiens (Human)
Description:
P13866
Residue:
664
  
Inhibitor
Name:
BDBM50386890
Synonyms:
CHEMBL2048494
Type:
Small organic molecule
Emp. Form.:
C23H30O4
Mol. Mass.:
370.4819
SMILES:
CCc1ccc(Cc2ccc(C)c(c2)[C@@H]2C[C@H](CO)[C@@H](O)[C@H](O)[C@H]2O)cc1
: