Target
Stromelysin-1
Ligand
BDBM50386895
Substrate
Meas. Tech.
ChEMBL_827435 (CHEMBL2051214)
IC50
14810±n/a nM
Citation
 Wang, LLi, XZhang, SLu, WLiao, SLiu, XShan, LShen, XJiang, HZhang, WHuang, JLi, H Natural products as a gold mine for selective matrix metalloproteinases inhibitors. Bioorg Med Chem 20:4164-71 (2012)  
Target
Name:
Stromelysin-1
Synonyms:
MMP-3 MMP3_HUMAN Matrix metalloproteinase 3 Matrix metalloproteinase-3 (MMP-3) SL-1 Stromelysin 1 | Transin-1
Type:
Enzyme
Mol. Mass.:
53973.13
Organism:
Homo sapiens (Human)
Description:
P08254
Residue:
477
  
Inhibitor
Name:
BDBM50386895
Synonyms:
CHEMBL2048506
Type:
Small organic molecule
Emp. Form.:
C31H30O12
Mol. Mass.:
594.5627
SMILES:
CCCCOC(=O)[C@@H]1[C@H](Oc2c1c(\C=C\C(=O)O[C@H](Cc1ccc(O)c(O)c1)C(O)=O)ccc2O)c1ccc(O)c(O)c1
: