Target
Glycogen synthase kinase-3 beta
Ligand
BDBM50386928
Substrate
Meas. Tech.
ChEMBL_827455 (CHEMBL2051312)
IC50
9±n/a nM
Citation
 Lee, SCKim, HTPark, CHLee, do YChang, HJPark, SCho, JMRo, SSuh, YG Design, synthesis and biological evaluation of novel imidazopyridines as potential antidiabetic GSK3ß inhibitors. Bioorg Med Chem Lett 22:4221-4 (2012)  
Target
Name:
Glycogen synthase kinase-3 beta
Synonyms:
GSK-3 beta GSK3B Glycogen synthase kinase 3 beta (GSK3B) Glycogen synthase kinase-3 beta (GSK-3B) Glycogen synthase kinase-3 beta (GSK3B) Glycogen synthase kinase-3beta (GSK3B) | Serine/threonine-protein kinase GSK3B
Type:
Enzyme
Mol. Mass.:
46756.38
Organism:
Homo sapiens (Human)
Description:
P49841
Residue:
420
  
Inhibitor
Name:
BDBM50386928
Synonyms:
CHEMBL2048673
Type:
Small organic molecule
Emp. Form.:
C18H14ClN5O2
Mol. Mass.:
367.789
SMILES:
Clc1ncccc1CCNC(=O)c1ccnc2nc([nH]c12)-c1ccoc1
: