Target
Growth hormone secretagogue receptor type 1
Ligand
BDBM50386955
Substrate
Meas. Tech.
ChEMBL_827488 (CHEMBL2051345)
IC50
4.6±n/a nM
Citation
 Kung, DWCoffey, SBJones, RMCabral, SJiao, WFichtner, MCarpino, PARose, CRHank, RFLopaze, MGSwartz, RChen, HTHendsch, ZPosner, BWielis, CFManning, BDubins, JStock, IAVarma, SCampbell, MDeBartola, DKosa-Maines, RSteyn, SJMcClure, KF Identification of spirocyclic piperidine-azetidine inverse agonists of the ghrelin receptor. Bioorg Med Chem Lett 22:4281-7 (2012)  
Target
Name:
Growth hormone secretagogue receptor type 1
Synonyms:
GH-releasing peptide receptor GHS-R GHSR_HUMAN Ghrelin receptor | Ghrelin receptor 1a (GHS-R1a)
Type:
Receptor
Mol. Mass.:
41334.57
Organism:
Homo sapiens (Human)
Description:
Receptor binding studies use plasma membranes from LLC PK-1 cells transiently transfected with hGHSR1a.
Residue:
366
  
Inhibitor
Name:
BDBM50386955
Synonyms:
CHEMBL2048820
Type:
Small organic molecule
Emp. Form.:
C24H26ClN7OS
Mol. Mass.:
496.028
SMILES:
Cc1cn2cc(CC(=O)N3CCC4(CN(Cc5ccc(cc5Cl)-n5nccn5)C4)CC3)nc2s1
: