Target
Renin
Ligand
BDBM50387262
Substrate
Meas. Tech.
ChEMBL_827988 (CHEMBL2051643)
IC50
1±n/a nM
Citation
 Nakamura, YSugita, CMeguro, MMiyazaki, STamaki, KTakahashi, MNagai, YNagayama, TKato, MSuemune, HNishi, T Design and optimization of novel (2S,4S,5S)-5-amino-6-(2,2-dimethyl-5-oxo-4-phenylpiperazin-1-yl)-4-hydroxy-2-isopropylhexanamides as renin inhibitors. Bioorg Med Chem Lett 22:4561-6 (2012)  
Target
Name:
Renin
Synonyms:
Angiotensinogenase RENI_HUMAN
Type:
Enzyme
Mol. Mass.:
45058.99
Organism:
Homo sapiens (Human)
Description:
Residue:
406
  
Inhibitor
Name:
BDBM50387262
Synonyms:
CHEMBL2048702
Type:
Small organic molecule
Emp. Form.:
C25H41ClN4O3
Mol. Mass.:
481.071
SMILES:
CCCCNC(=O)[C@@H](C[C@H](O)[C@@H](N)CN1CC(=O)N(CC1(C)C)c1ccccc1Cl)C(C)C
: