Target
Solute carrier family 12 member 5
Ligand
BDBM50387285
Substrate
Meas. Tech.
ChEMBL_828024 (CHEMBL2049718)
IC50
537±n/a nM
Citation
 Delpire, EBaranczak, AWaterson, AGKim, KKett, NMorrison, RDDaniels, JSWeaver, CDLindsley, CW Further optimization of the K-Cl cotransporter KCC2 antagonist ML077: development of a highly selective and more potent in vitro probe. Bioorg Med Chem Lett 22:4532-5 (2012)  
Target
Name:
Solute carrier family 12 member 5
Synonyms:
Electroneutral potassium-chloride cotransporter 2 KCC2 Neuronal K-Cl cotransporter SLC12A5 electroneutral potassium-chloride cotransporter KCC2 | hKCC2
Type:
PROTEIN
Mol. Mass.:
126185.18
Organism:
Homo sapiens (Human)
Description:
ChEMBL_828024
Residue:
1139
  
Inhibitor
Name:
BDBM50387285
Synonyms:
CHEMBL2048846
Type:
Small organic molecule
Emp. Form.:
C17H16N4OS2
Mol. Mass.:
356.465
SMILES:
CN(C(=O)CSc1ccc(nn1)-c1ccccc1)c1nc(C)cs1
: