Target
Protein kinase C theta type
Ligand
BDBM50387342
Substrate
Meas. Tech.
ChEMBL_828096 (CHEMBL2049835)
Ki
85±n/a nM
Citation
 Jimenez, JMDavis, CBoyall, DFraysse, DKnegtel, RSettimo, LYoung, SBolton, CChiu, PCurnock, ARasmussen, RTanner, AAger, I Structure-based optimization of aminopyridines as PKC¿ inhibitors. Bioorg Med Chem Lett 22:4645-9 (2012)  
Target
Name:
Protein kinase C theta type
Synonyms:
KPCT_HUMAN PRKCT Protein kinase C theta type (PRKCQ) nPKC-theta
Type:
Serine/threonine-protein kinase
Mol. Mass.:
81878.04
Organism:
Homo sapiens (Human)
Description:
Full-length human PKC theta (Panvera Catalog No. P2996).
Residue:
706
  
Inhibitor
Name:
BDBM50387342
Synonyms:
CHEMBL2046636
Type:
Small organic molecule
Emp. Form.:
C17H21N5O
Mol. Mass.:
311.3815
SMILES:
CC1(C)CN(CCN1)c1cccc(n1)C(=O)c1cccnc1N
: