Target
Protein kinase C delta type
Ligand
BDBM50387351
Substrate
Meas. Tech.
ChEMBL_828099 (CHEMBL2049838)
Ki
1300±n/a nM
Citation
 Jimenez, JMDavis, CBoyall, DFraysse, DKnegtel, RSettimo, LYoung, SBolton, CChiu, PCurnock, ARasmussen, RTanner, AAger, I Structure-based optimization of aminopyridines as PKC¿ inhibitors. Bioorg Med Chem Lett 22:4645-9 (2012)  
Target
Name:
Protein kinase C delta type
Synonyms:
KPCD_HUMAN PKCD Protein Kinase C- delta nPKC-delta
Type:
Enzyme
Mol. Mass.:
77516.79
Organism:
Homo sapiens (Human)
Description:
The recombinant human PKC enzymes were produced using a baculovirus expression system in SF9 cells
Residue:
676
  
Inhibitor
Name:
BDBM50387351
Synonyms:
CHEMBL2046647
Type:
Small organic molecule
Emp. Form.:
C21H26F3N5O2
Mol. Mass.:
437.4586
SMILES:
CC(C)C[C@H]1CN(CCN1)c1ccc(OCC(F)(F)F)c(n1)C(=O)c1cccnc1N
: