Target
Protein kinase C theta type
Ligand
BDBM50387330
Substrate
Meas. Tech.
ChEMBL_828101 (CHEMBL2049840)
IC50
52±n/a nM
Citation
 Jimenez, JMDavis, CBoyall, DFraysse, DKnegtel, RSettimo, LYoung, SBolton, CChiu, PCurnock, ARasmussen, RTanner, AAger, I Structure-based optimization of aminopyridines as PKC¿ inhibitors. Bioorg Med Chem Lett 22:4645-9 (2012)  
Target
Name:
Protein kinase C theta type
Synonyms:
KPCT_HUMAN PRKCT Protein kinase C theta type (PRKCQ) nPKC-theta
Type:
Serine/threonine-protein kinase
Mol. Mass.:
81878.04
Organism:
Homo sapiens (Human)
Description:
Full-length human PKC theta (Panvera Catalog No. P2996).
Residue:
706
  
Inhibitor
Name:
BDBM50387330
Synonyms:
CHEMBL2046643
Type:
Small organic molecule
Emp. Form.:
C20H24F3N5O
Mol. Mass.:
407.4327
SMILES:
CC(C)C[C@H]1CN(CCN1)c1ccc(c(n1)C(=O)c1cccnc1N)C(F)(F)F
: