Target
Protein kinase C theta type
Ligand
BDBM50387352
Substrate
Meas. Tech.
ChEMBL_828101 (CHEMBL2049840)
IC50
410±n/a nM
Citation
 Jimenez, JMDavis, CBoyall, DFraysse, DKnegtel, RSettimo, LYoung, SBolton, CChiu, PCurnock, ARasmussen, RTanner, AAger, I Structure-based optimization of aminopyridines as PKC¿ inhibitors. Bioorg Med Chem Lett 22:4645-9 (2012)  
Target
Name:
Protein kinase C theta type
Synonyms:
KPCT_HUMAN PRKCT Protein kinase C theta type (PRKCQ) nPKC-theta
Type:
Serine/threonine-protein kinase
Mol. Mass.:
81878.04
Organism:
Homo sapiens (Human)
Description:
Full-length human PKC theta (Panvera Catalog No. P2996).
Residue:
706
  
Inhibitor
Name:
BDBM50387352
Synonyms:
CHEMBL2046648
Type:
Small organic molecule
Emp. Form.:
C22H31N5O
Mol. Mass.:
381.5144
SMILES:
CCCc1ccc(nc1C(=O)c1cccnc1N)N1CCN[C@@H](CC(C)C)C1
: