Target
Serine/threonine-protein kinase PLK1
Ligand
BDBM50387330
Substrate
Meas. Tech.
ChEMBL_828123 (CHEMBL2049862)
Ki
>4000±n/a nM
Citation
 Jimenez, JMDavis, CBoyall, DFraysse, DKnegtel, RSettimo, LYoung, SBolton, CChiu, PCurnock, ARasmussen, RTanner, AAger, I Structure-based optimization of aminopyridines as PKC¿ inhibitors. Bioorg Med Chem Lett 22:4645-9 (2012)  
Target
Name:
Serine/threonine-protein kinase PLK1
Synonyms:
PLK PLK1 Polo-like kinase 1 (PlK1) STPK13 Serine/threonine-protein kinase 13 | polo-like kinase
Type:
Serine/threonine-protein kinase
Mol. Mass.:
68277.16
Organism:
Homo sapiens (Human)
Description:
P53350
Residue:
603
  
Inhibitor
Name:
BDBM50387330
Synonyms:
CHEMBL2046643
Type:
Small organic molecule
Emp. Form.:
C20H24F3N5O
Mol. Mass.:
407.4327
SMILES:
CC(C)C[C@H]1CN(CCN1)c1ccc(c(n1)C(=O)c1cccnc1N)C(F)(F)F
: