Target
Histamine H4 receptor
Ligand
BDBM50387423
Substrate
Meas. Tech.
ChEMBL_828300 (CHEMBL2050319)
Ki
158.49±n/a nM
Citation
 Engelhardt, Hde Esch, IJKuhn, DSmits, RAZuiderveld, OPDobler, JMayer, MLips, SArnhof, HScharn, DHaaksma, EELeurs, R Detailed structure-activity relationship of indolecarboxamides as H4 receptor ligands. Eur J Med Chem 54:660-8 (2012)  
Target
Name:
Histamine H4 receptor
Synonyms:
AXOR35 GPCR105 HH4R HRH4 Histamine H4 receptor Histamine receptor (H3 and H4) SP9144
Type:
G Protein-Coupled Receptor (GPCR)
Mol. Mass.:
44517.02
Organism:
Homo sapiens (Human)
Description:
Binding assays were using CHO cells stably expressing hH4R receptors.
Residue:
390
  
Inhibitor
Name:
BDBM50387423
Synonyms:
CHEMBL2047272
Type:
Small organic molecule
Emp. Form.:
C14H16ClN3O
Mol. Mass.:
277.749
SMILES:
CN1CCN(CC1)C(=O)c1cc2ccc(Cl)cc2[nH]1
: