Target
Histamine H4 receptor
Ligand
BDBM22566
Substrate
Meas. Tech.
ChEMBL_828305 (CHEMBL2050324)
IC50
40±n/a nM
Citation
 Engelhardt, Hde Esch, IJKuhn, DSmits, RAZuiderveld, OPDobler, JMayer, MLips, SArnhof, HScharn, DHaaksma, EELeurs, R Detailed structure-activity relationship of indolecarboxamides as H4 receptor ligands. Eur J Med Chem 54:660-8 (2012)  
Target
Name:
Histamine H4 receptor
Synonyms:
HH4R Hrh4
Type:
G Protein-Coupled Receptor (GPCR)
Mol. Mass.:
44272.75
Organism:
Mus musculus (mouse)
Description:
Cell pellets from SK-N-MC cells transfected with mouse H4 receptor were used in binding assay.
Residue:
391
  
Inhibitor
Name:
BDBM22566
Synonyms:
5-chloro-2-[(4-methylpiperazin-1-yl)carbonyl]-1H-indole JNJ 7777120
Type:
Small organic molecule
Emp. Form.:
C14H16ClN3O
Mol. Mass.:
277.749
SMILES:
CN1CCN(CC1)C(=O)c1cc2cc(Cl)ccc2[nH]1
: