Target
Phosphatidylinositol 4,5-bisphosphate 3-kinase catalytic subunit gamma isoform
Ligand
BDBM50387539
Substrate
Meas. Tech.
ChEMBL_830191 (CHEMBL2062041)
IC50
6.31±n/a nM
Citation
 Ellard, KSunose, MBell, KRamsden, NBergamini, GNeubauer, G Discovery of novel PI3K¿/d inhibitors as potential agents for inflammation. Bioorg Med Chem Lett 22:4546-9 (2012)  
Target
Name:
Phosphatidylinositol 4,5-bisphosphate 3-kinase catalytic subunit gamma isoform
Synonyms:
PI3-kinase p110 subunit gamma PI3Kgamma PK3CG_HUMAN Phosphatidylinositol 4,5-bisphosphate 3-kinase (PI3K) Phosphatidylinositol 4,5-bisphosphate 3-kinase catalytic subunit gamma (PI3Kgamma) Phosphatidylinositol 4,5-bisphosphate 3-kinase catalytic subunit gamma isoform (PI3K) Phosphatidylinositol-4,5-bisphosphate 3-kinase catalytic subunit gamma isoform Phosphoinositide 3-kinases gamma (PI3K gamma) p120-PI3K
Type:
Enzyme Subunit
Mol. Mass.:
126470.30
Organism:
Homo sapiens (Human)
Description:
P48736
Residue:
1102
  
Inhibitor
Name:
BDBM50387539
Synonyms:
CHEMBL2057366
Type:
Small organic molecule
Emp. Form.:
C22H25N9O3S
Mol. Mass.:
495.557
SMILES:
CC(C)(C)NS(=O)(=O)c1cncc(c1)-c1ccc2nc(NC(=O)NCCc3cnccn3)nn2c1
: