Target
D(1A) dopamine receptor
Ligand
BDBM50387558
Substrate
Meas. Tech.
ChEMBL_830331 (CHEMBL2060920)
IC50
30.7±n/a nM
Citation
 Qian, WLu, WSun, HLi, ZZhu, LZhao, RZhang, LZhou, SZhou, YJiang, HZhen, XLiu, H Design, synthesis, and pharmacological evaluation of novel tetrahydroprotoberberine derivatives: selective inhibitors of dopamine D1 receptor. Bioorg Med Chem 20:4862-71 (2012)  
Target
Name:
D(1A) dopamine receptor
Synonyms:
DA D1 receptor DRD1 Dopamine D1 receptor Dopamine D1A
Type:
Enzyme
Mol. Mass.:
49303.43
Organism:
Homo sapiens (Human)
Description:
P21728
Residue:
446
  
Inhibitor
Name:
BDBM50387558
Synonyms:
CHEMBL2057456
Type:
Small organic molecule
Emp. Form.:
C21H25NO5
Mol. Mass.:
371.4269
SMILES:
COc1cc2CCN3Cc4c(OC)cc(OC)c(CO)c4C[C@H]3c2cc1O
: