Target
Serine/threonine-protein kinase mTOR
Ligand
BDBM50387582
Substrate
Meas. Tech.
ChEMBL_830504 (CHEMBL2061274)
Ki
272±n/a nM
Citation
 Le, PTCheng, HNinkovic, SPlewe, MHuang, XWang, HBagrodia, SSun, SKnighton, DRLaFleur Rogers, CMPannifer, AGreasley, SDalvie, DZhang, E Design and synthesis of a novel pyrrolidinyl pyrido pyrimidinone derivative as a potent inhibitor of PI3Ka and mTOR. Bioorg Med Chem Lett 22:5098-103 (2012)  
Target
Name:
Serine/threonine-protein kinase mTOR
Synonyms:
FK506-binding protein 12-rapamycin complex-associated protein 1 FRAP FRAP1 MTOR Mammalian Target of Rapamycin (mTOR) RAFT1 Rapamycin and FKBP12 target 1 Serine/threonine-protein kinase (mTOR) | mTORC2
Type:
Rapamycin target protein
Mol. Mass.:
288917.12
Organism:
Homo sapiens (Human)
Description:
P42345
Residue:
2549
  
Inhibitor
Name:
BDBM50387582
Synonyms:
CHEMBL2057736 | US8633204, 196
Type:
Small organic molecule
Emp. Form.:
C18H19FN6O2
Mol. Mass.:
370.3809
SMILES:
COc1ncc(cc1F)-c1cc2c(C)nc(N)nc2n(N2CCCC2)c1=O
: