Target
Phosphatidylinositol 4,5-bisphosphate 3-kinase catalytic subunit alpha isoform
Ligand
BDBM50387582
Substrate
Meas. Tech.
ChEMBL_830503 (CHEMBL2061273)
Ki
2±n/a nM
Citation
 Le, PTCheng, HNinkovic, SPlewe, MHuang, XWang, HBagrodia, SSun, SKnighton, DRLaFleur Rogers, CMPannifer, AGreasley, SDalvie, DZhang, E Design and synthesis of a novel pyrrolidinyl pyrido pyrimidinone derivative as a potent inhibitor of PI3Ka and mTOR. Bioorg Med Chem Lett 22:5098-103 (2012)  
Target
Name:
Phosphatidylinositol 4,5-bisphosphate 3-kinase catalytic subunit alpha isoform
Synonyms:
PI3-kinase p110 subunit alpha PI3K Phosphatidylinositol 3-kinase p110α (p110α) Phosphatidylinositol-4,5-bisphosphate 3-kinase catalytic subunit alpha isoform PtdIns-3-kinase p110
Type:
Protein
Mol. Mass.:
124421.84
Organism:
Mus musculus (Mouse)
Description:
P42337
Residue:
1068
  
Inhibitor
Name:
BDBM50387582
Synonyms:
CHEMBL2057736 | US8633204, 196
Type:
Small organic molecule
Emp. Form.:
C18H19FN6O2
Mol. Mass.:
370.3809
SMILES:
COc1ncc(cc1F)-c1cc2c(C)nc(N)nc2n(N2CCCC2)c1=O
: