Target
Corticotropin-releasing factor receptor 1
Ligand
BDBM50387617
Substrate
Meas. Tech.
ChEMBL_830642 (CHEMBL2061535)
IC50
2.1±n/a nM
Citation
 Dzierba, CDSielecki, TMArvanitis, AGGalka, AJohnson, TLTakvorian, AGRafalski, MKasireddy-Polam, PVig, SDasgupta, BZhang, GMolski, TFWong, HZaczek, RCLodge, NJCombs, APGilligan, PJTrainor, GLBronson, JJMacor, JE Synthesis and structure-activity relationships of pyrido[3,2-b]pyrazin-3(4H)-ones and pteridin-7(8H)-ones as corticotropin-releasing factor-1 receptor antagonists. Bioorg Med Chem Lett 22:4986-9 (2012)  
Target
Name:
Corticotropin-releasing factor receptor 1
Synonyms:
CRF-R CRFR1_RAT Corticotropin releasing factor receptor Corticotropin-releasing Factor Receptor 1 Crhr | Crhr1
Type:
G Protein-Coupled Receptor (GPCR)
Mol. Mass.:
47870.75
Organism:
Rattus norvegicus (rat)
Description:
Receptor binding assays were performed using rat cortex homogenate.
Residue:
415
  
Inhibitor
Name:
BDBM50387617
Synonyms:
CHEMBL2057478
Type:
Small organic molecule
Emp. Form.:
C20H21ClFN3O3
Mol. Mass.:
405.85
SMILES:
CCC(COC)n1c2nccc(-c3cc(F)c(OC)cc3Cl)c2nc(C)c1=O
: