Target
Long-chain fatty acid transport protein 1
Ligand
BDBM50387693
Substrate
Meas. Tech.
ChEMBL_830659 (CHEMBL2061594)
IC50
200±n/a nM
Citation
 Matsufuji, TIkeda, MNaito, AHirouchi, MTakakusa, HKanda, SIzumi, MHarada, JShinozuka, T Discovery and optimization of novel fatty acid transport protein 1 (FATP1) inhibitors. Bioorg Med Chem Lett 22:5067-70 (2012)  
Target
Name:
Long-chain fatty acid transport protein 1
Synonyms:
6.2.1.- Fatp Fatty acid transport protein 1 Slc27a1 | Solute carrier family 27 member 1
Type:
PROTEIN
Mol. Mass.:
71289.41
Organism:
Mus musculus
Description:
ChEMBL_956919
Residue:
646
  
Inhibitor
Name:
BDBM50387693
Synonyms:
CHEMBL2058349
Type:
Small organic molecule
Emp. Form.:
C22H24N6O2S
Mol. Mass.:
436.53
SMILES:
CCC(N=O)c1ccc2oc(CSc3nnc(CNc4ccccc4)n3CC)nc2c1
: