Target
Long-chain fatty acid transport protein 1
Ligand
BDBM50387695
Substrate
Meas. Tech.
ChEMBL_830659 (CHEMBL2061594)
IC50
1200±n/a nM
Citation
 Matsufuji, TIkeda, MNaito, AHirouchi, MTakakusa, HKanda, SIzumi, MHarada, JShinozuka, T Discovery and optimization of novel fatty acid transport protein 1 (FATP1) inhibitors. Bioorg Med Chem Lett 22:5067-70 (2012)  
Target
Name:
Long-chain fatty acid transport protein 1
Synonyms:
6.2.1.- Fatp Fatty acid transport protein 1 Slc27a1 | Solute carrier family 27 member 1
Type:
PROTEIN
Mol. Mass.:
71289.41
Organism:
Mus musculus
Description:
ChEMBL_956919
Residue:
646
  
Inhibitor
Name:
BDBM50387695
Synonyms:
CHEMBL2058345
Type:
Small organic molecule
Emp. Form.:
C22H23N5O2S
Mol. Mass.:
421.515
SMILES:
CCC(=O)c1ccc2nc(CSc3nnc(CNc4ccccc4)n3CC)oc2c1
: