Target
Poly [ADP-ribose] polymerase 1
Ligand
BDBM50387939
Substrate
Meas. Tech.
ChEMBL_830732 (CHEMBL2061719)
EC50
11±n/a nM
Citation
 Zhu, GDGong, JGandhi, VBLiu, XShi, YJohnson, EFDonawho, CKEllis, PABouska, JJOsterling, DJOlson, AMPark, CLuo, YShoemaker, AGiranda, VLPenning, TD Discovery and SAR of orally efficacious tetrahydropyridopyridazinone PARP inhibitors for the treatment of cancer. Bioorg Med Chem 20:4635-45 (2012)  
Target
Name:
Poly [ADP-ribose] polymerase 1
Synonyms:
(ARTD1 or PARP1) 2.4.2.30 ADPRT ARTD1 Human diphtheria toxin-like ADP-ribosyltransferase (ARTD1 or PARP1) NT-PARP-1 PARP1 PPOL Poly [ADP-ribose] polymerase 1 (PARP) Poly [ADP-ribose] polymerase 1 (PARP1) Poly [ADP-ribose] polymerase 1, 28-kDa form Poly [ADP-ribose] polymerase 1, processed C-terminus Poly [ADP-ribose] polymerase-1 Poly(ADP-ribose) polymerase-1 (ARTD1/PARP1) Protein poly-ADP-ribosyltransferase PARP1 | Synonyms=ADPRT
Type:
Mol. Mass.:
113114.22
Organism:
Homo sapiens (Human)
Description:
P09874
Residue:
1014
  
Inhibitor
Name:
BDBM50387939
Synonyms:
CHEMBL2058920 | US9283222, 551
Type:
Small organic molecule
Emp. Form.:
C26H26FN5O3
Mol. Mass.:
475.5147
SMILES:
Fc1ccc(Cc2n[nH]c(=O)c3CCCNc23)cc1C(=O)N1CCN(CC1)C(=O)c1ccccc1
: