Target
Serine/threonine-protein kinase mTOR
Ligand
BDBM50388105
Substrate
Meas. Tech.
ChEMBL_829330 (CHEMBL2060320)
IC50
>5000±n/a nM
Citation
 Martínez González, SHernández, AIVarela, CLorenzo, MRamos-Lima, FCendón, ECebrián, DAguirre, EGomez-Casero, EAlbarrán, MIAlfonso, PGarcía-Serelde, BMateos, GOyarzabal, JRabal, OMulero, FGonzalez-Granda, TLink, WFominaya, JBarbacid, MBischoff, JRPizcueta, PBlanco-Aparicio, CPastor, J Rapid identification of ETP-46992, orally bioavailable PI3K inhibitor, selective versus mTOR. Bioorg Med Chem Lett 22:5208-14 (2012)  
Target
Name:
Serine/threonine-protein kinase mTOR
Synonyms:
FK506-binding protein 12-rapamycin complex-associated protein 1 FRAP FRAP1 MTOR Mammalian Target of Rapamycin (mTOR) RAFT1 Rapamycin and FKBP12 target 1 Serine/threonine-protein kinase (mTOR) | mTORC2
Type:
Rapamycin target protein
Mol. Mass.:
288917.12
Organism:
Homo sapiens (Human)
Description:
P42345
Residue:
2549
  
Inhibitor
Name:
BDBM50388105
Synonyms:
CHEMBL2058169
Type:
Small organic molecule
Emp. Form.:
C21H27N9O3
Mol. Mass.:
453.4976
SMILES:
Nc1ncc(cn1)-c1cn2cc(nc2c(n1)N1CCOCC1)C(=O)NCCN1CCOCC1
: