Target
Phosphatidylinositol 4,5-bisphosphate 3-kinase catalytic subunit alpha isoform
Ligand
BDBM50388105
Substrate
Meas. Tech.
ChEMBL_829331 (CHEMBL2060321)
IC50
10.4±n/a nM
Citation
 Martínez González, SHernández, AIVarela, CLorenzo, MRamos-Lima, FCendón, ECebrián, DAguirre, EGomez-Casero, EAlbarrán, MIAlfonso, PGarcía-Serelde, BMateos, GOyarzabal, JRabal, OMulero, FGonzalez-Granda, TLink, WFominaya, JBarbacid, MBischoff, JRPizcueta, PBlanco-Aparicio, CPastor, J Rapid identification of ETP-46992, orally bioavailable PI3K inhibitor, selective versus mTOR. Bioorg Med Chem Lett 22:5208-14 (2012)  
Target
Name:
Phosphatidylinositol 4,5-bisphosphate 3-kinase catalytic subunit alpha isoform
Synonyms:
P42336 PI3-kinase subunit p110-alpha PIK3CA Phosphatidylinositol 3-kinase alpha (PI3Kalpha) Phosphatidylinositol 4,5-bisphosphate 3-kinase (PI3K) Phosphatidylinositol 4,5-bisphosphate 3-kinase catalytic subunit alpha (PI3Kalpha) Phosphatidylinositol 4,5-bisphosphate 3-kinase catalytic subunit alpha isoform (PI3-Ka) Phosphatidylinositol 4,5-bisphosphate 3-kinase catalytic subunit alpha isoform (PI3K p110alpha) Phosphatidylinositol 4,5-bisphosphate 3-kinase catalytic subunit alpha isoform (PI3K-alpha) Phosphatidylinositol 4,5-bisphosphate 3-kinase catalytic subunit alpha isoform (PI3Kalpha p110alpha) Phosphatidylinositol 4,5-bisphosphate 3-kinase catalytic subunit alpha isoform (PIK3CA) Phosphatidylinositol-4,5-bisphosphate 3-kinase catalytic subunit alpha isoform Phosphoinositide 3-Kinase (PI3K), alpha Chain A Phosphoinositide 3-kinases (PI3K) PtdIns-3-kinase p110 | p110 alpha
Type:
Enzyme Subunit
Mol. Mass.:
124294.87
Organism:
Homo sapiens (Human)
Description:
P42336
Residue:
1068
  
Inhibitor
Name:
BDBM50388105
Synonyms:
CHEMBL2058169
Type:
Small organic molecule
Emp. Form.:
C21H27N9O3
Mol. Mass.:
453.4976
SMILES:
Nc1ncc(cn1)-c1cn2cc(nc2c(n1)N1CCOCC1)C(=O)NCCN1CCOCC1
: