Target
Dipeptidyl peptidase 4
Ligand
BDBM50206038
Substrate
Meas. Tech.
ChEMBL_829355 (CHEMBL2060146)
IC50
1.6±n/a nM
Citation
 Yoshida, TAkahoshi, FSakashita, HSonda, STakeuchi, MTanaka, YNabeno, MKishida, HMiyaguchi, IHayashi, Y Fused bicyclic heteroarylpiperazine-substituted L-prolylthiazolidines as highly potent DPP-4 inhibitors lacking the electrophilic nitrile group. Bioorg Med Chem 20:5033-41 (2012)  
Target
Name:
Dipeptidyl peptidase 4
Synonyms:
ADABP Adenosine deaminase complexing protein 2 CD_antigen=CD26 DPP4 DPPIV Dipeptidyl peptidase 4 (DPP IV) Dipeptidyl peptidase 4 (DPP4) Dipeptidyl peptidase 4 membrane form Dipeptidyl peptidase IV Dipeptidyl peptidase IV (DDP-IV) Dipeptidyl peptidase IV membrane form Dipeptidyl peptidase-IV (DPP-4) T-cell activation antigen CD26 | TP103
Type:
Enzyme
Mol. Mass.:
88271.01
Organism:
Homo sapiens (Human)
Description:
P27487
Residue:
766
  
Inhibitor
Name:
BDBM50206038
Synonyms:
((2S,4S)-4-(4-(4-nitrophenyl)piperazin-1-yl)pyrrolidin-2-yl)(thiazolidin-3-yl)methanone | CHEMBL391466
Type:
Small organic molecule
Emp. Form.:
C18H25N5O3S
Mol. Mass.:
391.488
SMILES:
[O-][N+](=O)c1ccc(cc1)N1CCN(CC1)[C@@H]1CN[C@@H](C1)C(=O)N1CCSC1
: