Target
Endochitinase A1
Ligand
BDBM50388141
Substrate
Meas. Tech.
ChEMBL_828637 (CHEMBL2060194)
IC50
>1000000±n/a nM
Citation
 Schüttelkopf, AWAndersen, OARao, FVAllwood, MRush, CLEggleston, IMvan Aalten, DM Bisdionin C-a rationally designed, submicromolar inhibitor of family 18 chitinases. ACS Med Chem Lett 2:428-432 (2011)  
Target
Name:
Endochitinase A1
Synonyms:
CHIA1_ASPFM chi1 | chiA1
Type:
Enzyme
Mol. Mass.:
83057.83
Organism:
Neosartorya fumigata (Aspergillus fumigatus)
Description:
Q873Y0
Residue:
825
  
Inhibitor
Name:
BDBM50388141
Synonyms:
CHEMBL1232048
Type:
Small organic molecule
Emp. Form.:
C16H18N8O4
Mol. Mass.:
386.3653
SMILES:
Cn1cnc2n(C)c(=O)n(CCn3c(=O)n(C)c4ncn(C)c4c3=O)c(=O)c12
: