Target
DNA-(apurinic or apyrimidinic site) endonuclease
Ligand
BDBM114652
Substrate
Meas. Tech.
ChEMBL_829669 (CHEMBL2061059)
IC50
1000±n/a nM
Citation
 Rai, GVyjayanti, VNDorjsuren, DSimeonov, AJadhav, AWilson, DMMaloney, DJ Synthesis, biological evaluation, and structure-activity relationships of a novel class of apurinic/apyrimidinic endonuclease 1 inhibitors. J Med Chem 55:3101-12 (2012)  
Target
Name:
DNA-(apurinic or apyrimidinic site) endonuclease
Synonyms:
APE APEX APEX1_HUMAN Apurinic-apyrimidinic endonuclease 1 (APE-1) DNA-(apurinic or apyrimidinic site) lyase REF1
Type:
Protein
Mol. Mass.:
35560.12
Organism:
Homo sapiens (Human)
Description:
P27695
Residue:
318
  
Inhibitor
Name:
BDBM114652
Synonyms:
CHEMBL1706858 N-[3-(1,3-benzothiazol-2-yl)-5,6-dihydro-4H-thieno[2,3-c]pyrrol-2-yl]acetamide;2,2,2-trifluoroacetic acid SMR001522662 | cid_60138096
Type:
Small organic molecule
Emp. Form.:
C15H13N3OS2
Mol. Mass.:
315.413
SMILES:
CC(=O)Nc1sc2CNCc2c1-c1nc2ccccc2s1
: