Target
Peptidyl-prolyl cis-trans isomerase FKBP5
Ligand
BDBM50388291
Substrate
Meas. Tech.
ChEMBL_829707 (CHEMBL2061147)
IC50
27200±n/a nM
Citation
 Gopalakrishnan, RKozany, CWang, YSchneider, SHoogeland, BBracher, AHausch, F Exploration of pipecolate sulfonamides as binders of the FK506-binding proteins 51 and 52. J Med Chem 55:4123-31 (2012)  
Target
Name:
Peptidyl-prolyl cis-trans isomerase FKBP5
Synonyms:
51 kDa FK506-binding protein 54 kDa progesterone receptor-associated immunophilin Androgen-regulated protein 6 FK506-binding protein 5 FKBP-51 FKBP51 FKBP5_HUMAN PPIase FKBP5 p54
Type:
PROTEIN
Mol. Mass.:
51207.06
Organism:
Homo sapiens (Human)
Description:
ChEMBL_952910
Residue:
457
  
Inhibitor
Name:
BDBM50388291
Synonyms:
CHEMBL2058498
Type:
Small organic molecule
Emp. Form.:
C33H36N2O12S
Mol. Mass.:
684.71
SMILES:
COc1ccc(CC[C@@H](OC(=O)[C@@H]2CCCCN2S(=O)(=O)c2cc3CCOc3c(c2)[N+]([O-])=O)c2cccc(OCC(O)=O)c2)cc1OC
: