Target
Peptidyl-prolyl cis-trans isomerase FKBP4
Ligand
BDBM50388279
Substrate
Meas. Tech.
ChEMBL_829706 (CHEMBL2061146)
IC50
15690±n/a nM
Citation
 Gopalakrishnan, RKozany, CWang, YSchneider, SHoogeland, BBracher, AHausch, F Exploration of pipecolate sulfonamides as binders of the FK506-binding proteins 51 and 52. J Med Chem 55:4123-31 (2012)  
Target
Name:
Peptidyl-prolyl cis-trans isomerase FKBP4
Synonyms:
FK506 binding protein 4 FKBP4_HUMAN | FKBP52
Type:
PROTEIN
Mol. Mass.:
51793.87
Organism:
Homo sapiens (Human)
Description:
ChEMBL_154482
Residue:
459
  
Inhibitor
Name:
BDBM50388279
Synonyms:
CHEMBL2058233
Type:
Small organic molecule
Emp. Form.:
C31H34BrNO9S
Mol. Mass.:
676.572
SMILES:
COc1ccc(CC[C@@H](OC(=O)[C@@H]2CCCCN2S(=O)(=O)c2cccc(Br)c2)c2cccc(OCC(O)=O)c2)cc1OC
: