Target
Peptidyl-prolyl cis-trans isomerase FKBP1A
Ligand
BDBM50109811
Substrate
Meas. Tech.
ChEMBL_829709 (CHEMBL2061149)
IC50
17±n/a nM
Citation
 Gopalakrishnan, RKozany, CGaali, SKress, CHoogeland, BBracher, AHausch, F Evaluation of synthetic FK506 analogues as ligands for the FK506-binding proteins 51 and 52. J Med Chem 55:4114-22 (2012)  
Target
Name:
Peptidyl-prolyl cis-trans isomerase FKBP1A
Synonyms:
12 kDa FK506-binding protein FK506-binding protein 1A FKB1A_HUMAN FKBP-1A FKBP12 Immunophilin FKBP12 PPIase FKBP1A Rotamase mTOR/FKBP12A/FKBP12B
Type:
Isomerase
Mol. Mass.:
11953.09
Organism:
Homo sapiens (Human)
Description:
P62942
Residue:
108
  
Inhibitor
Name:
BDBM50109811
Synonyms:
(S)-1-[2-Oxo-2-(3,4,5-trimethoxy-phenyl)-acetyl]-piperidine-2-carboxylic acid 4-pyridin-3-yl-1-(3-pyridin-3-yl-propyl)-butyl ester CHEMBL350775
Type:
Small organic molecule
Emp. Form.:
C34H41N3O7
Mol. Mass.:
603.7052
SMILES:
COc1cc(cc(OC)c1OC)C(=O)C(=O)N1CCCC[C@H]1C(=O)OC(CCCc1cccnc1)CCCc1cccnc1
: