Target
Fibroblast growth factor 1
Ligand
BDBM50388343
Substrate
Meas. Tech.
ChEMBL_829712 (CHEMBL2061152)
Kd
0.24±n/a nM
Citation
 Ferro, VLiu, LJohnstone, KDWimmer, NKaroli, THandley, PRowley, JDredge, KLi, CPHammond, EDavis, KSarimaa, LHarenberg, JBytheway, I Discovery of PG545: a highly potent and simultaneous inhibitor of angiogenesis, tumor growth, and metastasis. J Med Chem 55:3804-13 (2012)  
Target
Name:
Fibroblast growth factor 1
Synonyms:
Acidic fibroblast growth factor ECGF-beta FGF1_HUMAN Fibroblast growth factor 1 (FGF-1) Heparin-binding growth factor 1 | aFGF
Type:
Protein
Mol. Mass.:
17461.01
Organism:
Homo sapiens (Human)
Description:
P05230
Residue:
155
  
Inhibitor
Name:
BDBM50388343
Synonyms:
CHEMBL2059243
Type:
Small organic molecule
Emp. Form.:
C63H91N3O75S16
Mol. Mass.:
2603.421
SMILES:
CC(C)CCC[C@@H](C)[C@H]1CC[C@H]2[C@@H]3CC[C@H]4C[C@H](CC[C@]4(C)[C@H]3CC[C@]12C)OCc1cn(CCCO[C@H]2O[C@H](COS([O-])(=O)=O)[C@@H](OS([O-])(=O)=O)[C@H](OS([O-])(=O)=O)[C@@H]2O[C@H]2O[C@H](COS([O-])(=O)=O)[C@@H](OS([O-])(=O)=O)[C@H](O[C@H]3O[C@H](COS([O-])(=O)=O)[C@@H](OS([O-])(=O)=O)[C@H](O[C@H]4O[C@H](COS([O-])(=O)=O)[C@@H](OS([O-])(=O)=O)[C@H](O[C@H]5O[C@H](COS([O-])(=O)=O)[C@@H](OS([O-])(=O)=O)[C@H](OS([O-])(=O)=O)[C@@H]5OS([O-])(=O)=O)[C@@H]4OS([O-])(=O)=O)[C@@H]3OS([O-])(=O)=O)[C@@H]2OS([O-])(=O)=O)nn1
: