Target
Tyrosyl-DNA phosphodiesterase 1
Ligand
BDBM50388593
Substrate
Meas. Tech.
ChEMBL_830577 (CHEMBL2061432)
IC50
>111000±n/a nM
Citation
 Nguyen, TXMorrell, AConda-Sheridan, MMarchand, CAgama, KBermingham, ABermingam, AStephen, AGChergui, ANaumova, AFisher, RO'Keefe, BRPommier, YCushman, M Synthesis and biological evaluation of the first dual tyrosyl-DNA phosphodiesterase I (Tdp1)-topoisomerase I (Top1) inhibitors. J Med Chem 55:4457-78 (2012)  
Target
Name:
Tyrosyl-DNA phosphodiesterase 1
Synonyms:
TDP1 Tyrosyl-DNA phosphodiesterase 1 | Tyrosyl-DNA phosphodiesterase 1 (TDP1)
Type:
Enzyme
Mol. Mass.:
68430.66
Organism:
Homo sapiens (Human)
Description:
Q9NUW8
Residue:
608
  
Inhibitor
Name:
BDBM50388593
Synonyms:
CHEMBL123218
Type:
Small organic molecule
Emp. Form.:
C18H13NO3
Mol. Mass.:
291.3007
SMILES:
OCCn1c2-c3ccccc3C(=O)c2c2ccccc2c1=O
: