Target
Nuclear receptor subfamily 1 group D member 1
Ligand
BDBM50366238
Substrate
Meas. Tech.
ChEMBL_829093 (CHEMBL2059915)
IC50
670±n/a nM
Citation
 Shin, YNoel, RBanerjee, SKojetin, DSong, XHe, YLin, LCameron, MDBurris, TPKamenecka, TM Small molecule tertiary amines as agonists of the nuclear hormone receptor Rev-erba. Bioorg Med Chem Lett 22:4413-7 (2012)  
Target
Name:
Nuclear receptor subfamily 1 group D member 1
Synonyms:
EAR-1 HREV NR1D1_HUMAN THRAL | V-erbA-related protein 1
Type:
PROTEIN
Mol. Mass.:
66822.11
Organism:
Homo sapiens (Human)
Description:
ChEMBL_958222
Residue:
614
  
Inhibitor
Name:
BDBM50366238
Synonyms:
CHEMBL1961796
Type:
Small organic molecule
Emp. Form.:
C20H24ClN3O4S
Mol. Mass.:
437.94
SMILES:
CCOC(=O)N1CCC(CN(Cc2ccc(s2)[N+]([O-])=O)Cc2ccc(Cl)cc2)C1
: