Target
Nuclear receptor subfamily 1 group D member 1
Ligand
BDBM50388649
Substrate
Meas. Tech.
ChEMBL_829091 (CHEMBL2060741)
EC50
570±n/a nM
Citation
 Shin, YNoel, RBanerjee, SKojetin, DSong, XHe, YLin, LCameron, MDBurris, TPKamenecka, TM Small molecule tertiary amines as agonists of the nuclear hormone receptor Rev-erba. Bioorg Med Chem Lett 22:4413-7 (2012)  
Target
Name:
Nuclear receptor subfamily 1 group D member 1
Synonyms:
EAR-1 HREV NR1D1_HUMAN THRAL | V-erbA-related protein 1
Type:
PROTEIN
Mol. Mass.:
66822.11
Organism:
Homo sapiens (Human)
Description:
ChEMBL_958222
Residue:
614
  
Inhibitor
Name:
BDBM50388649
Synonyms:
CHEMBL2059697
Type:
Small organic molecule
Emp. Form.:
C18H22ClN3O4S2
Mol. Mass.:
443.968
SMILES:
CS(=O)(=O)N1CCC(CN(Cc2ccc(s2)[N+]([O-])=O)Cc2ccc(Cl)cc2)C1
: