Target
Tyrosine-protein kinase Lck
Ligand
BDBM25116
Substrate
Meas. Tech.
ChEMBL_830841 (CHEMBL2065347)
Ki
63±n/a nM
Citation
 Milletti, FHermann, JC Targeted kinase selectivity from kinase profiling data. ACS Med Chem Lett 3:383-386 (2012)  
Target
Name:
Tyrosine-protein kinase Lck
Synonyms:
2.7.10.2 LCK_HUMAN Leukocyte C-terminal Src kinase Lymphocyte-specific protein tyrosine kinase Protein YT16 Proto-oncogene tyrosine-protein kinase LCK T cell-specific protein-tyrosine kinase
Type:
Mol. Mass.:
57987.83
Organism:
Homo sapiens (Human)
Description:
P06239
Residue:
509
  
Inhibitor
Name:
BDBM25116
Synonyms:
1-tert-butyl-3-(4-methylphenyl)-1H-pyrazolo[3,4-d]pyrimidin-4-amine PP1 US10807986, Comparative compound 1 US11701353, PP1 (Pfizer) | cid_1400
Type:
Small organic molecule
Emp. Form.:
C16H19N5
Mol. Mass.:
281.3556
SMILES:
Cc1ccc(cc1)-c1nn(c2ncnc(N)c12)C(C)(C)C
: