Target
Mast/stem cell growth factor receptor Kit
Ligand
BDBM50381719
Substrate
Meas. Tech.
ChEMBL_830837 (CHEMBL2065343)
Ki
40±n/a nM
Citation
 Milletti, FHermann, JC Targeted kinase selectivity from kinase profiling data. ACS Med Chem Lett 3:383-386 (2012)  
Target
Name:
Mast/stem cell growth factor receptor Kit
Synonyms:
CD117 antigen KIT Mast/stem cell growth factor receptor Kit (cKIT) Proto-oncogene tyrosine-protein kinase Kit Stem cell growth factor receptor Tyrosine-protein kinase Kit c-kit v-kit Hardy-Zuckerman 4 feline sarcoma viral oncogene homolog
Type:
Protein
Mol. Mass.:
109869.37
Organism:
Homo sapiens (Human)
Description:
P10721
Residue:
976
  
Inhibitor
Name:
BDBM50381719
Synonyms:
CHEMBL2022856
Type:
Small organic molecule
Emp. Form.:
C26H23FN6O2S
Mol. Mass.:
502.563
SMILES:
C[C@@H](O)Cn1cc(cn1)-c1cnc(N)c2c(csc12)-c1ccc(NC(=O)Nc2cccc(F)c2)cc1
: